{"text_format":"1","workbook":"xlsx","n_sheets":7,"sheets":["Macro Instructions","Section A","Section B","Section C","Save and Upload","FileMaker Format","Administrators"],"not_rendered":{"charts":0,"images":2,"macros":1,"external_links":0,"defined_names":5,"comments":2,"pivot_tables":0},"unopened":[],"bounds":{"document_bytes":16777216,"sheet_cells":100000,"rows_first":2000,"rows_last":500,"rows_between":2000,"halvings":0,"cell_chars":16384,"cell_head_chars":4096},"cells_cut":0,"cells_raw":0,"read":"whole","date_system":"1900"}

{"sheet":"Macro Instructions","index":0,"n_rows":4,"n_cols":9,"rows_kept":4,"cut":false,"hidden":false,"merged":[[3,2,36,13],[0,8,1,13]]}
[null,null,null,null,null,null,null,null,"Impact Fund Household Demographic/ Project Information Form\nMacro Instructions"]
[]
[]
[null,null,"Please enable macros prior to completing this form.\n\nTo enable Macros in Excel:\n\n1. In Excel 2000 or 2003:\n      - Navigate to the 'Tools' tab > 'Macro' > Security\n      - Select an appropriate setting to allow completion of this form.\n\n2. In Excel 2007:\n      - Click on the 'Office' button.\n      - Click on 'Excel Options'\n      - Select 'Trust Center' > 'Trust Center Settings'. Choose a  security setting (see explanation of Macro Settings below).\n\n3. In Excel 2010 or 2013:\n      - Navigate to the 'File' Tab > 'Options'\n      - Click on 'Trust Center' > Trust Center Settings'\n      - Click on 'Macro Settings'. Choose a security setting (see explanation of Macro Settings below).\n     -  Check the box 'Trust access to the VBA project object model'\n\nExplanation of Macro (Security) Settings in Excel 2007, 2010 and 2013:\n\n1. Disable all macros without notification: Blocks all macros without notifying the user.\n2. Disable all macros with notification: RECOMMENDED WHEN COMPLETING THIS WORKSHEET: Macros are disabled, but when you open a workbook Excel will ask whether you want to run the macro.\n\n\n3. Disable all macros except digitally signed macros: Same as #2 above, except that macros are automatically allowed if they're signed by trusted publishers. (The macros in this worksheet are not digitally signed.)\n4. Enable all macros (not recommended, potentially dangerous code can run): Not recommended; will allow all macros to run without prompting the user.\n\nWhen saving, please save as a Macro-enabled Workbook.\n\n\n\n"]

{"sheet":"Section A","index":1,"n_rows":101,"n_cols":30,"rows_kept":101,"cut":false,"hidden":false,"merged":[[51,13,51,14],[16,13,16,14],[17,13,17,14],[9,9,9,13],[24,13,24,14],[25,13,25,14],[42,13,42,14],[31,11,31,12],[47,13,47,14],[48,13,48,14],[48,9,48,11],[47,9,47,11],[50,13,50,14],[47,2,47,4],[32,17,33,17],[31,6,31,8],[41,13,41,14],[42,2,42,4],[45,13,45,14],[44,13,44,14],[44,2,44,4],[32,14,33,14],[31,2,31,4],[42,9,42,10],[38,13,38,14],[39,13,39,14],[24,2,24,4],[27,2,27,4],[44,9,44,11],[38,2,38,4],[41,2,41,4],[41,9,41,11],[39,9,39,10],[24,6,24,7],[27,6,27,7],[38,9,38,11],[1,7,1,18],[2,2,2,17],[16,6,16,7],[19,6,19,7],[6,9,6,13],[6,6,6,7],[6,2,6,4],[9,2,9,4],[13,4,13,6],[16,2,16,4],[19,2,19,4],[9,6,9,7]]}
[]
[null,null,null,null,null,null,null,"Community Homeownership Impact Fund \n(Impact Fund) Program                                                                                                                                           Household Demographic/Project Information Form"]
[null,null,"Instructions:  Please complete this Household Demographic/Project Information Form for each Project completed under an Impact Fund Award.  Complete both Section A, Section B and Section C, save the form, then use Minnesota Housing's Secure File Upload tool to submit this form to the Impact Fund team at impact.fund.mhfa@state.mn.us. You can find Instructions and a link to the Secure Upload tool on Section B of this form, and on Minnesota Housing's website.  You can find much of the information needed to fill out this form from the following documents: the Settlement Statement (e.g., HUD-1) or Closing Disclosure, the Uniform Residential Appraisal Report, Borrower's Application, and your Impact Fund  Agreement or Contract. This form must not be modified without advance, specific written authorization from Minnesota Housing.  \n\nContact the Impact Fund team at impact.fund.mhfa@state.mn.us with any questions or concerns. "]
[]
[null,"Administrator Information"]
[]
[null,null,"Administrator's  Name",null,null,null,null,null,null,null,null,null,null,null,null,null,null,null,null,null,null,"Click to Select",null,"Click to Select"]
[null,null,"Administrator's  Name",null,null,null,"Award ID#",null,null,"Contact Person",null,null,null,null,null,null,null,null,null,null,null,"Male ",null,"Married"]
[null,null,null,null,null,null,null,null,null,null,null,null,null,null,null,null,null,null,null,null,null,"Female",null,"Separated"]
[null,null,null,null,null,null,null,null,null,null,null,null,null,null,null,null,null,null,null,null,null,"Chose not to identify",null,"Not Married (Includes Single, Divorced, Widowed)"]
{"$rows_left_out":92}
{"sheet":"Section B","index":2,"n_rows":278,"n_cols":32,"rows_kept":278,"cut":false,"hidden":false,"merged":[[66,8,66,9],[43,7,44,7],[43,8,44,8],[3,3,3,4],[19,2,19,3],[58,2,58,3],[51,2,51,3],[52,2,52,3],[53,2,53,3],[40,2,40,3],[41,2,41,3],[42,2,42,3],[43,2,43,3]]}
[]
[null,null,"Unit Development Costs and Leverage"]
[null,null,null,null,null,null,null,null,null,null,null,null,null,"Click to Select","New Construction","Acquisition, Rehab, Resale","Stand-Alone Affordability Gap","Owner-Occupied Rehab","Tribal Indian Housing Program"]
[null,null,"Activity Type",{"$f":"IF('Section A'!E14=\"Click to Select\",\"Please select in Section A\",'Section A'!E14)","v":"Please select in Section A"},null,null,null,"Owner Occupied Rehab (OOR (Only))",null,null,null,null,null,"Click to Select","CDBG - Federal Government","City Government","County Government","Developer","Employer","Family Housing Fund","Federal Home Loan Bank","Foundation","Gift Funds","GMHF","HUD - Federal Government","Local Federal Government","Metropolitan Council","State - Non-MHFA","Bank/Lender","Private Loan - Owner/Developer","RD - Federal Government","Third-Party Seller"]
["Applies?",null,null,null,null,null,null,"Accessibility",0,null,null,null,null,"Click to Select","DEED Small Cities","CDBG - Federal Government","City Government","County Government","Foundation","GMHF","RD - Federal Government","Other State Funds - Non-MHFA","Gift Funds","Bank/Lender","Federal Home Loan Bank"]
[{"$f":"IFERROR(INDEX(field_lookup,MATCH($C6,$N$9:$N$28,0),MATCH($D$4,$N$9:$P$9,0)),\"\")","v":""},null,"Land Acquisition Costs",null,0,null,null,"Site Work",0]
[{"$f":"IFERROR(INDEX(field_lookup,MATCH($C7,$N$9:$N$28,0),MATCH($D$4,$N$9:$P$9,0)),\"\")","v":""},null,"Structure Acquisition Costs",null,0,null,null,"Building Envelope",0,null,null,null,null,"This table is used to determine which hard costs apply to the selected activity type. This is referenced in Column A."]
[{"$f":"IFERROR(INDEX(field_lookup,MATCH($C8,$N$9:$N$28,0),MATCH($D$4,$N$9:$P$9,0)),\"\")","v":""},null,"General Construction",null,0,null,null,"Electrical",0,null,null,null,null,"Enter Y for applicable fields:"]
["",null,"Site Work",null,0,null,null,"Garage",0,null,null,null,null,"Hard Cost/Activity","New Construction","Acquisition, Rehab, Resale"]
["",null,"Demolition Costs",null,0,null,null,"Heating,  Vent., & Air Conditioning",0,null,null,null,null,"Land Acquisition Costs","Y","Y"]
{"$rows_left_out":269}
{"sheet":"Section C","index":3,"n_rows":85,"n_cols":29,"rows_kept":85,"cut":false,"hidden":false,"merged":[[11,6,11,9],[76,4,76,9],[26,4,26,9],[41,4,41,9],[54,4,54,9],[64,4,64,9],[76,14,76,19],[11,16,11,19],[26,14,26,19],[41,14,41,19],[54,14,54,19],[64,14,64,19]]}
[]
["Borrower's Race and Ethnicity",null,null,null,null,null,"Page 1",null,null,null,"CoBorrower's Race and Ethnicity",null,null,null,null,null,"Page 1",null,null,null,null,"Borrower Race","Co Race","Borrower Ethnicity","Co Ethnicity","Borrower Specify","Co Specify","Borrower SubCat","Co SubCat"]
["(Select as many of the categories and subcategories that apply)",null,null,null,null,null,null,null,null,null,"(Select as many of the categories and subcategories that apply)",null,null,null,null,null,null,null,null,null,null,{"$f":"CONCATENATE(X5,Z5,X6,Z6,X17,Z17,X30,Z30,X48,Z48,X58,Z58,X68)","v":""},{"$f":"CONCATENATE(Y5,AA5,Y6,AA6,Y17,AA17,Y30,AA30,Y48,AA48,Y58,AA58,Y68)","v":""},{"$f":"CONCATENATE(X9,Z9,X10,Z10,X11,Z11,X20,Z20,X23,Z23,X24,Z24,X25,Z25,X26,Z26,X28,Z28,X33,Z33,X34,Z34,X35,Z35,X36,Z36,X37,Z37,X38,Z38,X39,Z39,X40,Z40,X41,Z41,X43,Z43,X51,Z51,X52,Z52,X53,Z53,X54,Z54,X56,Z56,X61,Z61,X62,Z62,X63,Z63,X64,Z64,X66,Z66,X72,Z72,X73,Z73,,X74,Z74,X75,Z75,X76,Z76,X78)","v":""},{"$f":"CONCATENATE(Y9,AA9,Y10,AA10,Y11,AA11,Y20,AA20,Y23,AA23,Y24,AA24,Y25,AA25,Y26,AA26,Y28,AA28,Y33,AA33,Y34,AA34,Y35,AA35,Y36,AA36,Y37,AA37,Y38,AA38,Y39,AA39,Y40,AA40,Y41,AA41,Y43,AA43,Y51,AA51,Y52,AA52,Y53,AA53,Y54,AA54,Y56,AA56,Y61,AA61,Y62,AA62,Y63,AA63,Y64,AA64,Y66,AA66,Y72,AA72,Y73,AA73,,Y74,AA74,Y75,AA75,Y76,AA76,Y78)","v":""},{"$f":"CONCATENATE(X12,Z12,X27,Z27,X42,Z42,X55,Z55,X65,Z65,X77)","v":""},{"$f":"CONCATENATE(Y12,AA12,Y27,AA27,Y42,AA42,Y55,AA55,Y65,AA65,Y77)","v":""},{"$f":"CONCATENATE(X13,Z13,X14,Z14,X15)","v":""},{"$f":"CONCATENATE(Y13,AA13,Y14,AA14,Y15)","v":""}]
[null,null,null,null,null,null,null,null,null,null,null,null,null,null,null,null,null,null,null,null,"Race / Ethnicity","Borrower checked?","CoBorrower checked?","Borrower Label Checked?","Co Borrower Label Checked?","Borrower Comma","CoBorrower Comma"]
[null,null,null,null,null,null,null,null,null,null,null,null,null,null,null,null,null,null,null,null,"Choose not to identify",false,false,{"$f":"IF(V5=TRUE,$U5,\"\")","v":""},{"$f":"IF(W5=TRUE,$U5,\"\")","v":""},{"$f":"IF(AND(V5=TRUE,OR(V$6=TRUE,V$17=TRUE,V$30=TRUE,V$48=TRUE,V$58=TRUE,V$68=TRUE)),\", \",\"\")","v":""},{"$f":"IF(AND(W5=TRUE,OR(W$6=TRUE,W$17=TRUE,W$30=TRUE,W$48=TRUE,W$58=TRUE,W$68=TRUE)),\", \",\"\")","v":""}]
[null,null,null,null,null,null,null,null,null,null,null,null,null,null,null,null,null,null,null,null,"American Indian / Alaska Native",false,false,{"$f":"IF(V6=TRUE,$U6,\"\")","v":""},{"$f":"IF(W6=TRUE,$U6,\"\")","v":""},{"$f":"IF(AND(V6=TRUE,OR(V$17=TRUE,V$30=TRUE,V$48=TRUE,V$58=TRUE,V$68=TRUE)),\", \",\"\")","v":""},{"$f":"IF(AND(W6=TRUE,OR(W$17=TRUE,W$30=TRUE,W$48=TRUE,W$58=TRUE,W$68=TRUE)),\", \",\"\")","v":""}]
[null,null,"(people having origins in any of the original people of North, Central or South America)",null,null,null,null,null,null,null,null,null,"(people having origins in any of the original people of North, Central or South America)"]
[null,null," – select all subcategories that apply:",null,null,null,null,null,null,null,null,null," – select all subcategories that apply:"]
[null,null,null,null,null,null,null,null,null,null,null,null,null,null,null,null,null,null,null,null,"Anishinaabe / Ojibwe",false,false,{"$f":"IF(V9=TRUE,$U9,\"\")","v":""},"",{"$f":"IF(AND(V9=TRUE,OR(V$10=TRUE,V$11=TRUE,V$20=TRUE,V$23=TRUE,V$24=TRUE,V$25=TRUE,V$26=TRUE,V$28=TRUE,V$33=TRUE,V$34=TRUE,V$35=TRUE,V$36=TRUE,V$37=TRUE,V$38=TRUE,V$39=TRUE,V$40=TRUE,V$41=TRUE,V$43=TRUE,V$51=TRUE,V$52=TRUE,V$53=TRUE,V$54=TRUE,V$56=TRUE,V$61=TRUE,V$62=TRUE,V$63=TRUE,V$64=TRUE,V$66=TRUE,V$72=TRUE,V$73=TRUE,V$74=TRUE,V$75=TRUE,V$76=TRUE,V$78=TRUE)),\", \",\"\")","v":""},{"$f":"IF(AND(W9=TRUE,OR(W$10=TRUE,W$11=TRUE,W$20=TRUE,W$23=TRUE,W$24=TRUE,W$25=TRUE,W$26=TRUE,W$28=TRUE,W$33=TRUE,W$34=TRUE,W$35=TRUE,W$36=TRUE,W$37=TRUE,W$38=TRUE,W$39=TRUE,W$40=TRUE,W$41=TRUE,W$43=TRUE,W$51=TRUE,W$52=TRUE,W$53=TRUE,W$54=TRUE,W$56=TRUE,W$61=TRUE,W$62=TRUE,W$63=TRUE,W$64=TRUE,W$66=TRUE,W$72=TRUE,W$73=TRUE,W$74=TRUE,W$75=TRUE,W$76=TRUE,W$78=TRUE)),\", \",\"\")","v":""}]
[null,null,null,null,null,null,null,null,null,null,null,null,null,null,null,null,null,null,null,null,"Dakota / Lakota",false,false,"","",{"$f":"IF(AND(V10=TRUE,OR(V$11=TRUE,V$20=TRUE,V$23=TRUE,V$24=TRUE,V$25=TRUE,V$26=TRUE,V$28=TRUE,V$33=TRUE,V$34=TRUE,V$35=TRUE,V$36=TRUE,V$37=TRUE,V$38=TRUE,V$39=TRUE,V$40=TRUE,V$41=TRUE,V$43=TRUE,V$51=TRUE,V$52=TRUE,V$53=TRUE,V$54=TRUE,V$56=TRUE,V$61=TRUE,V$62=TRUE,V$63=TRUE,V$64=TRUE,V$66=TRUE,V$72=TRUE,V$73=TRUE,V$74=TRUE,V$75=TRUE,V$76=TRUE,V$78=TRUE)),\", \",\"\")","v":""},{"$f":"IF(AND(W10=TRUE,OR(W$11=TRUE,W$20=TRUE,W$23=TRUE,W$24=TRUE,W$25=TRUE,W$26=TRUE,W$28=TRUE,W$33=TRUE,W$34=TRUE,W$35=TRUE,W$36=TRUE,W$37=TRUE,W$38=TRUE,W$39=TRUE,W$40=TRUE,W$41=TRUE,W$43=TRUE,W$51=TRUE,W$52=TRUE,W$53=TRUE,W$54=TRUE,W$56=TRUE,W$61=TRUE,W$62=TRUE,W$63=TRUE,W$64=TRUE,W$66=TRUE,W$72=TRUE,W$73=TRUE,W$74=TRUE,W$75=TRUE,W$76=TRUE,W$78=TRUE)),\", \",\"\")","v":""}]
{"$rows_left_out":76}
{"sheet":"Save and Upload","index":4,"n_rows":5,"n_cols":6,"rows_kept":5,"cut":false,"hidden":false,"merged":[[0,0,0,9],[1,0,1,9],[4,1,4,3],[4,5,4,8]]}
["When saving and sending this form, please use the format \"Administrator_Award ID_Borrower Last Name\", or click the \"Save Form\" button below.\n\n\n\n"]
["Important! You must maintain documentation to support all information submitted through this form. It is your responsibility to ensure all information submitted to Minnesota Housing is accurate and complete. Minnesota Housing reserves the right to test all information submitted for compliance with the Loan/Grant Agreement."]
[]
[]
[null,"Secure File Upload ",null,null,null,"Secure File Upload Instructions"]

{"sheet":"FileMaker Format","index":5,"n_rows":2,"n_cols":140,"rows_kept":2,"cut":false,"hidden":true,"merged":[]}
["32 Door","Accessibility","Accessibility ARR","Acquisition","Activity Type","Admin Name","Affordability Gap","Agreement ID#","Appraised Value of Unit","Bath on Main Level","Bond Proceeds","Borrower DOB","Borrower Ethnicity","Borrower Ethnicity Specify","Borrower Ethnicity SubCat","Borrower First Name","Borrower Gender","Borrower Last Name","Borrower Marital Status","Borrower MI","Borrower Phone","Borrower Race","Borrower SS","Building Envelope ARR","Co Ethnicity","Co Ethnicity Specify","Co Ethnicity SubCat","Co First Name","Co Gender","Co Last Name","Co Marital Status","Co MI","Co Race","Co SS","Coborrower DOB","CoBorrower Phone","Construction Type","Date Form Completed","Date of Closing","Date of Entry","Demolition","Devel Admin Fee Taken","Disability HH","Electrical","Electrical ARR","Energy Conservation","Energy Conservation ARR","First Mortgage Funds","First Mortgage Funds1","First Mortgage Source","First Mortgage Source1","FU/CFU IR write-down","Garage","Garage ARR","Garage NC","General Construction NC","Gross Household Income","Hard Costs Other","Hard Costs Other NC","Heating","Heating Ven AC ARR","Holding Costs","Housing Ratio","Interim Constr Financing","Interior Finishing","Interior Finishing ARR","Interior Remodel/Alterations","Interior Remodel/Alterations ARR","Lead Related Work","Lead Related Work ARR","Marketing Realtor","Miscellaneous","No Step","Non MHFA Funds 1A","Non MHFA Funds 1V","Non MHFA Funds 2A","Non MHFA Funds 2V","Non MHFA Funds 3A","Non MHFA Funds 3V","Non MHFA Funds 4A","Non MHFA Funds 4V","Non MHFA Funds Source 1","Non MHFA Funds Source 2","Non MHFA Funds Source 3","Non MHFA Funds Source 4","Non MHFA Funds Source 5","Non MHFA Funds Source 6","Non MHFA Funds Source 7","Non MHFA Funds Source 8","Non MHFA Int Constr Fin Funds","Non MHFA Interim Constr Fin Source","Non MHFA OOR Funds 1","Non MHFA OOR Funds 2","Non MHFA OOR Funds 3","Non MHFA OOR Funds 4","Non MHFA OOR Source 1","Non MHFA OOR Source 2","Non MHFA OOR Source 3","Non MHFA OOR Source 4","Number Adults","Number Bedrooms","Number Children","Number of Units","Other Developer fee soft costs","Other MHFA Funds 1A","Other MHFA Funds 2A","Other MHFA Funds 3A","Other MHFA Funds Source 1","Other MHFA Funds Source 2","Other MHFA Funds Source 3","Other Prof'l Fees","Owner Occupied Rehab","Ownership Type","Plumbing","Plumbing ARR","Prevailing Wage Applied?","Previous City Residence","Previous State Residence","Programs","Property Acquisition ARR","Property City","Property County","Property Street Address","Property Type","Property Zip Code","Purchase (sales) Price of Unit","Round","Settlement Charge to Borr","Site Work","Site Work ARR","Site Work NC","Square Footage","Structural Additions Alterations","Structure Type","Tribal First Mtg","Value Gap","Visitability NC","Windows","Windows ARR","Year Property Built"]
[{"$f":"IF('Section A'!W35=TRUE,\"Yes\",\"\")","v":""},{"$f":"'Section B'!I5","v":0},{"$f":"'Section B'!E13","v":0},{"$f":"IF('Section B'!D4<>\"Acquisition, Rehab, Resale\",'Section B'!E6+'Section B'!E7,0)","v":0},{"$f":"IF('Section A'!E14=\"Click to Select\",\"\",'Section A'!E14)","v":""},{"$f":"IF(ISBLANK('Section A'!C7),\"\",'Section A'!C7)","v":"Administrator's  Name"},{"$f":"'Section B'!E48","v":0},{"$f":"IF(ISBLANK('Section A'!G7),\"\",'Section A'!G7)","v":""},{"$f":"'Section A'!G45","v":0},{"$f":"IF('Section A'!W36=TRUE,\"Yes\",\"\")","v":""},{"$f":"'Section B'!E49+'Section B'!E40","v":0},{"$f":"IF(ISBLANK('Section A'!R17),\"\",'Section A'!R17)","v":""},{"$f":"'Section C'!X3","v":""},{"$f":"IF(ISBLANK('Section C'!Z3),\"\",'Section C'!Z3)","v":""},{"$f":"IF(ISBLANK('Section C'!AB3),\"\",'Section C'!AB3)","v":""},{"$f":"IF(ISBLANK('Section A'!G17),\"\",'Section A'!G17)","v":""},{"$f":"IF(OR(ISBLANK('Section A'!N17),'Section A'!N17=\"Click to Select\"),\"\",'Section A'!N17)","v":""},{"$f":"IF(ISBLANK('Section A'!C17),\"\",'Section A'!C17)","v":""},{"$f":"IF(OR(ISBLANK('Section A'!G20),'Section A'!G20=\"Click to Select\"),\"\",'Section A'!G20)","v":""},{"$f":"IF(ISBLANK('Section A'!J17),\"\",'Section A'!J17)","v":""},{"$f":"IF(ISBLANK('Section A'!C48),\"\",'Section A'!C48)","v":""},{"$f":"IF(ISBLANK('Section C'!V3),\"\",'Section C'!V3)","v":""},{"$f":"IF(ISBLANK('Section A'!C20),\"\",'Section A'!C20)","v":""},{"$f":"'Section B'!E14","v":0},{"$f":"IF(ISBLANK('Section C'!Y3),\"\",'Section C'!Y3)","v":""},{"$f":"IF(ISBLANK('Section C'!AA3),\"\",'Section C'!AA3)","v":""},{"$f":"IF(ISBLANK('Section C'!AC3),\"\",'Section C'!AC3)","v":""},{"$f":"IF(ISBLANK('Section A'!G25),\"\",'Section A'!G25)","v":""},{"$f":"IF(OR(ISBLANK('Section A'!N25),'Section A'!N25=\"Click to Select\"),\"\",'Section A'!N25)","v":""},{"$f":"IF(ISBLANK('Section A'!C25),\"\",'Section A'!C25)","v":""},{"$f":"IF(OR(ISBLANK('Section A'!G28),'Section A'!G28=\"Click to Select\"),\"\",'Section A'!G28)","v":""},{"$f":"IF(ISBLANK('Section A'!J25),\"\",'Section A'!J25)","v":""},{"$f":"IF(ISBLANK('Section C'!W3),\"\",'Section C'!W3)","v":""},{"$f":"IF(ISBLANK('Section A'!C28),\"\",'Section A'!C28)","v":""},{"$f":"IF(ISBLANK('Section A'!R25),\"\",'Section A'!R25)","v":""},{"$f":"IF(ISBLANK('Section A'!G48),\"\",'Section A'!G48)","v":""},{"$f":"IF('Section A'!N48=\"Click to Select\",\"\",'Section A'!N48)","v":""},{"$f":"IF(ISBLANK('Section A'!R10),\"\",'Section A'!R10)","v":""},{"$f":"IF(ISBLANK('Section A'!C45),\"\",'Section A'!C45)","v":""},{"$f":"NOW()","v":"2026-03-20T10:18:11.910"},{"$f":"'Section B'!E10","v":0},{"$f":"'Section B'!E56","v":0},{"$f":"IF('Section A'!L32=\"Click to Select\",\"\",'Section A'!L32)","v":""},{"$f":"'Section B'!I8","v":0},{"$f":"'Section B'!E15","v":0},{"$f":"'Section B'!I15","v":0},{"$f":"'Section B'!E22","v":0},{"$f":"IF('Section A'!R55=0,'Section A'!R42,'Section A'!R55)","v":0},{"$f":"IF('Section A'!R55>0,'Section A'!R56,\"\")","v":""},{"$f":"IF('Section A'!R39=\"Click to Select\",\"\",IF('Section A'!R55>0,\"Impact Fund\",'Section A'!R39))","v":""},{"$f":"IF(AND('Section A'!R55>0,'Section A'!R56>0),\"Other\",\"\")","v":""},{"$f":"IF(ISBLANK('Section B'!I44),\"\",'Section B'!I44)","v":0},{"$f":"'Section B'!I9","v":0},{"$f":"IF('Section B'!D4=\"Acquisition, Rehab, Resale\",'Section B'!E11,\"\")","v":""},{"$f":"IF('Section B'!$D$4<>\"Acquisition, Rehab, Resale\",'Section B'!E11,\"\")","v":0},{"$f":"IF('Section B'!$D$4<>\"Acquisition, Rehab, Resale\",'Section B'!E8,\"\")","v":0},{"$f":"'Section A'!C32","v":0},{"$f":"IF('Section B'!$D$4=\"Acquisition, Rehab, Resale\",'Section B'!E23,\"\")","v":""},{"$f":"IF('Section B'!$D$4<>\"Acquisition, Rehab, Resale\",'Section B'!E23,\"\")","v":0},{"$f":"'Section B'!I10","v":0},{"$f":"'Section B'!E20","v":0},{"$f":"'Section B'!E27","v":0},{"$f":"IF(ISBLANK('Section A'!R48),\"\",'Section A'!R48)","v":""},{"$f":"'Section B'!E58","v":0},{"$f":"'Section B'!I11","v":0},{"$f":"'Section B'!E19","v":0},{"$f":"'Section B'!I12","v":0},{"$f":"'Section B'!E18","v":0},{"$f":"'Section B'!I14","v":0},{"$f":"'Section B'!E16","v":0},{"$f":"'Section B'!E29","v":0},{"$f":"'Section B'!I17","v":0},{"$f":"IF('Section A'!W34=TRUE,\"Yes\",\"\")","v":""},{"$f":"'Section B'!E51","v":0},{"$f":"'Section B'!E41","v":0},{"$f":"'Section B'!E52","v":0},{"$f":"'Section B'!E42","v":0},{"$f":"'Section B'!E53","v":0},{"$f":"'Section B'!E43","v":0},{"$f":"'Section B'!E54","v":0},{"$f":"'Section B'!E44","v":0},{"$f":"IF(AND('Section B'!C41=\"Click to Select\",'Section B'!E41>0),\"Unknown\",IF(AND('Section B'!C41=\"Click to Select\",'Section B'!E41=0),\"\",'Section B'!C41))","v":""},{"$f":"IF(AND('Section B'!C42=\"Click to Select\",'Section B'!E42>0),\"Unknown\",IF(AND('Section B'!C42=\"Click to Select\",'Section B'!E42=0),\"\",'Section B'!C42))","v":""},{"$f":"IF(AND('Section B'!C43=\"Click to Select\",'Section B'!E43>0),\"Unknown\",IF(AND('Section B'!C43=\"Click to Select\",'Section B'!E43=0),\"\",'Section B'!C43))","v":""},{"$f":"IF(AND('Section B'!C44=\"Click to Select\",'Section B'!E44>0),\"Unknown\",IF(AND('Section B'!C44=\"Click to Select\",'Section B'!E44=0),\"\",'Section B'!C44))","v":""},{"$f":"IF('Section B'!E51>0,\"Homeowner\",\"\")","v":""},{"$f":"IF(AND('Section B'!E52>0,'Section B'!C52=\"Click to Select\"),\"Unknown\",IF(AND('Section B'!E52=0,'Section B'!C52=\"Click to Select\"),\"\",'Section B'!C52))","v":""},{"$f":"IF(AND('Section B'!E53>0,'Section B'!C53=\"Click to Select\"),\"Unknown\",IF(AND('Section B'!E53=0,'Section B'!C53=\"Click to Select\"),\"\",'Section B'!C53))","v":""},{"$f":"IF(AND('Section B'!E54>0,'Section B'!C54=\"Click to Select\"),\"Unknown\",IF(AND('Section B'!E54=0,'Section B'!C54=\"Click to Select\"),\"\",'Section B'!C54))","v":""},{"$f":"'Section B'!E59","v":0},{"$f":"IF('Section B'!C59<>\"<Enter Other Source (if any) Here>\",'Section B'!C59,\"\")","v":""},{"$f":"'Section B'!I29","v":0},{"$f":"'Section B'!I30","v":0},{"$f":"'Section B'!I31","v":0},{"$f":"'Section B'!I32","v":0},{"$f":"IF(CN2>0,\"Homeowner\",\"\")","v":""},{"$f":"IF('Section B'!H30=\"Click to Select\",\"\",'Section B'!H30)","v":""},{"$f":"IF('Section B'!H31=\"Click to Select\",\"\",'Section B'!H31)","v":""},{"$f":"IF('Section B'!H32=\"Click to Select\",\"\",'Section B'!H32)","v":""},{"$f":"'Section A'!O32","v":0},{"$f":"'Section A'!J42","v":0},{"$f":"'Section A'!R32","v":0},{"$f":"'Section A'!G42","v":0},{"$f":"'Section B'!E28+'Section B'!I20+'Section B'!E56","v":0},{"$f":"'Section B'!E50","v":0},{"$f":"IF('Section B'!I33>0,'Section B'!I33,IF('Section B'!I40>0,'Section B'!I40,\"\"))","v":""},{"$f":"IF('Section B'!I34>0,'Section B'!I34,\"\")","v":""},{"$f":"IF('Section B'!E50>0,\"MHFA DPA\",\"\")","v":""},{"$f":"IF(OR('Section B'!I33>0,'Section B'!I40>0),\"Fix Up/CFUL\",\"\")","v":""},{"$f":"IF('Section B'!I34>0,\"RLP/ELP\",\"\")","v":""},{"$f":"'Section B'!E30+'Section B'!I21","v":0},{"$f":"'Section B'!I28","v":0},{"$f":"IF(OR('Section A'!N45=\"Click to Select\",ISBLANK('Section A'!N45)),\"\",'Section A'!N45)","v":""},{"$f":"'Section B'!I13","v":0},{"$f":"'Section B'!E17","v":0},{"$f":"IF('Section A'!N51=\"Click to Select\",\"\",'Section A'!N51)","v":""},{"$f":"IF(ISBLANK('Section A'!G32),\"\",'Section A'!G32)","v":""},{"$f":"IF('Section A'!J32=\"Select\",\"\",'Section A'!J32)","v":0},null,{"$f":"IF('Section B'!D4=\"Acquisition, Rehab, Resale\",'Section B'!E6+'Section B'!E7,0)","v":0},{"$f":"IF(ISBLANK('Section A'!G39),\"\",'Section A'!G39)","v":""},{"$f":"IF(ISBLANK('Section A'!N39),\"\",'Section A'!N39)","v":""},{"$f":"IF(ISBLANK('Section A'!C39),\"\",'Section A'!C39)","v":""},{"$f":"IF('Section A'!R51=\"Click to Select\",\"\",'Section A'!R51)","v":""},{"$f":"IF(ISBLANK('Section A'!J39),\"\",'Section A'!J39)","v":""},{"$f":"'Section A'!J45","v":0},{"$f":"CHOOSE(MONTH(LEFT(H2,2)*29),\"January\",\"February\",\"March\",\"April\",\"May\",\"June\",\"July\",\"August\",\"September\",\"October\",\"November\",\"December\")&\" \"&(MID(H2,4,4))","v":{"$error":"#VALUE!"}},{"$f":"'Section A'!R45","v":0},{"$f":"'Section B'!I6","v":0},{"$f":"IF('Section B'!D4=\"Acquisition, Rehab, Resale\",'Section B'!E9, \"\")","v":""},{"$f":"IF('Section B'!D4=\"New Construction\",'Section B'!E9,\"\")","v":""},{"$f":"IF(ISBLANK('Section A'!N42),\"\",'Section A'!N42)","v":""},{"$f":"'Section B'!I7","v":0},{"$f":"IF('Section A'!J48=\"Click to Select\",\"\",'Section A'!J48)","v":""},{"$f":"'Section A'!R55","v":0},{"$f":"'Section B'!E39","v":0},{"$f":"IF('Section B'!D4=\"New Construction\",'Section B'!E12,\"\")","v":""},{"$f":"'Section B'!I16","v":0},{"$f":"'Section B'!E21","v":0},{"$f":"IF(ISBLANK('Section A'!C42),\"\",'Section A'!C42)","v":""}]

{"sheet":"Administrators","index":6,"n_rows":94,"n_cols":1,"rows_kept":94,"cut":false,"hidden":true,"merged":[]}
[]
["Age Well at Home"]
["Alexandria HRA"]
["Amani Construction & Development "]
["American Indian Dev Corp (AICDC)"]
["Anoka County CAP"]
["Anoka HRA"]
["Arrowhead EOA"]
["Bi-County CAP"]
["Bloomington HRA"]
{"$rows_left_out":84}